Requirements Contract Clause
type: Class
alternative label: 要求合同条款
subclass of: RDe0RKU39BlhcyACJW30ZLc
definition: A requirements contract clause is a provision in a contract that obligates one party to purchase goods or services exclusively from the other party for a specified period of time, based on the buyer's needs.