Unconscionability Permitting Contract Rescission
type: Class
alternative label: 允许合同撤销的不合理性
subclass of: RDP2t75tSvlsq1GCrOZlInL
subclass of: RZ1dOPJ6HH6lMJGSLNxfwV
definition: Unconscionability Permitting Contract Rescission refers to the legal concept that allows a contract to be cancelled or voided due to the presence of unfair or oppressive terms or circumstances that make it impossible for one party to fully understand or consent to the agreement.