Antitrust - Horizontal Claims
type: Class
alternative label: 反垄断 - 水平索赔
subclass of: RCFPWMbdFLbplboOqvI77Jh
definition: Antitrust - Horizontal Claims refer to legal claims made against companies that engage in anti-competitive behavior with their direct competitors, such as price-fixing or market allocation.