Minnesota District Court - Koochiching County
type: Class
subclass of: RxLV9XEaDWbDIA8N1fl2fM
definition: Minnesota District Court - Koochiching County refers to a specific court within the Minnesota District Court system that has jurisdiction over legal matters in Koochiching County.