Minnesota District Court - Clearwater County
type: Class
subclass of: RxLV9XEaDWbDIA8N1fl2fM
definition: Minnesota District Court - Clearwater County is a specific court within the Minnesota District Court system that has jurisdiction over legal matters within Clearwater County, Minnesota.