Strict Product Liability
type: Class
alternative label: 严格产品责任
subclass of: R7MsH9WtTPf14W1GB1m8zrB
subclass of: RdN6a66644QYTrLMGgEar
definition: Strict Product Liability is a legal concept that holds manufacturers and sellers responsible for any harm caused by their products, regardless of fault or negligence, if the product is found to be defective.