Washington Superior Court - Walla Walla County
type: Class
subclass of: RChEjOHUONk1Yp2qm3OHJdc
definition: Washington Superior Court - Walla Walla County: A specific court within the Washington Superior Court system that has jurisdiction over legal matters within Walla Walla County.