Estonian
type: Class
alternative label: 爱沙尼亚语
subclass of: RDOvAHsvY8TKJ1O1orXPM9o
definition: Estonian (Language) is a structured system of communication consisting of grammar and vocabulary used in Estonia and by Estonian speakers worldwide.