Trademark and Trade Dress Law
type: Class
alternative label: 商标和外观设计法
subclass of: RDdMucRftztKt4Ag7WzUxX
hidden label: TMRK
definition: Law protecting a business' commercial identity or brand by or product design discouraging other businesses from adopting a name, logo or design that is "confusingly similar" to an existing trademark or design.