Repossession of Goods / Reclamation
type: Class
alternative label: 货物回收 / 索赔
subclass of: R9pQxz2fUIrk1LjvVP8hikg
subclass of: RDSBerlLWg1ntpLqDQn1eVn
definition: The concept of Repossession of Goods/Reclamation refers to the legal process of taking back possession of property or goods that were sold or leased, due to a breach of contract or failure to make payments, and the rights and liabilities of the parties involved in such a process.