Florida Circuit Court - Highlands County - 10th Circuit Court
type: Class
subclass of: R3Q1HDu5jO8nvhdbr2Uj0c
definition: A court located in Highlands County, Florida that is part of the larger Florida Circuit Court system.