Trusts and Estate Planning Law
type: Class
alternative label: 信托和遗产规划法
subclass of: RBFgL4Dth9VONjmIdH0bEOs
hidden label: TRES
definition: Trusts and Estate Planning Law involves the legal planning and management of a person's assets and property during their lifetime and after their death, including the creation and administration of trusts, wills, and other estate planning documents.