Loss of Parental Consortium
type: Class
alternative label: 父母损失赔偿
subclass of: R7wQ6uN1h4BP4YPC7h9xoWG
definition: The loss of a parent's ability to provide love, affection, guidance, and support to their child due to injury or death caused by the negligence of another party.