Indiana Circuit Court - Monroe County Circuit 2
type: Class
subclass of: RCeiXNGpqL4H3jo1g1NobSm
definition: Indiana Circuit Court - Monroe County Circuit 2 is a specific court within the Indiana Circuit Court system that has jurisdiction over cases in Monroe County.