Medical Transport Negligence
type: Class
alternative label: 医疗运输过失
subclass of: R7Zbqfhemxs6PR7r2Fk6NeY
definition: Medical transport negligence refers to a claim of medical malpractice that arises from the negligent transportation of a patient, such as by ambulance or air transport.