Florida Circuit Court - Union County - 8th Circuit Court
type: Class
subclass of: R3Q1HDu5jO8nvhdbr2Uj0c
definition: A court located in Union County, Florida that is part of the 8th Circuit Court system.