New York Appellate Division - 4th Dept.
type: Class
subclass of: R79E394F641c4247d2dBE3ce
definition: The New York Appellate Division - 4th Dept. is a specific court within the New York Supreme Court - Appellate Division that hears appeals from lower courts in the western part of the state.