Ohio Municipal Court
type: Class
subclass of: R7D81edCD2d848A515dCCe2f
definition: Ohio Municipal Court is a court of limited jurisdiction in Ohio that handles minor criminal offenses, traffic violations, and civil cases within a specific geographic area.