Zaza; Dimili; Dimli; Kirdki; Kirmanjki; Zazaki
type: Class
alternative label: 扎扎基语; 迪米利语; 迪姆利语; 基尔德基语; 基尔曼基语; 扎扎基语
subclass of: RDOvAHsvY8TKJ1O1orXPM9o
definition: A language spoken in parts of Turkey and Iran, including dialects such as Zaza, Dimili, Dimli, Kirdki, Kirmanjki, and Zazaki.