Noncontravention Clause
type: Class
alternative label: 非违约条款
subclass of: RDe0RKU39BlhcyACJW30ZLc
definition: A Noncontravention Clause is a provision in a contract that ensures that the actions of one party will not violate any laws or agreements with third parties.