Antitrust - Refusal to Deal Claims
type: Class
alternative label: एंटीट्रस्ट - डील से इनकार दावे
subclass of: R8oBTLovip7JQGJ9AeOmmCD
definition: The concept of "Antitrust - Refusal to Deal Claims" refers to legal claims made against a company for refusing to do business with another company, in violation of antitrust laws.