Termination of Contract Clause
type: Class
alternative label: 合同终止条款
subclass of: R355Le1zLujnXiHMmYqQNM
definition: A Termination of Contract Clause is a provision in a contract that outlines the circumstances under which the agreement may be ended by one or both parties.