Lost Capacity in Living Resulting from Tort
type: Class
alternative label: 因酷刑而导致的生活能力丧失
subclass of: R8alUnZrt8GVEzHYhh1KTva
subclass of: RBgykmvlnXtCsXRVIBMbLrV
definition: The concept of Lost Capacity in Living Resulting from Tort refers to the reduction in a person's ability to enjoy life due to injuries caused by someone else's wrongful act, for which compensation may be sought in a personal injury claim under the category of non-economic damages.