Partnership Representative Clause
type: Class
alternative label: 合伙代表条款
subclass of: RDe0RKU39BlhcyACJW30ZLc
definition: A Partnership Representative Clause is a provision in a contract that designates a representative to act on behalf of a partnership in tax matters.