Joint Defense Group
type: Class
alternative label: 联合防御组
subclass of: R8xoAbLw9cOhM7q4iRXRmXu
subclass of: RCFgxBbypUKKsDDOJ1iOk36
definition: A group of parties who participate in a Joint Defense Agreement, usually separate parties (though in a similar position) who are defendants in a civil lawsuit.