Criminal Matter Identifiers
type: Class
alternative label: 刑事案件标识符
subclass of: RDwU1R53c1yOciDqUV1gV13
definition: Criminal Matter Identifiers are unique codes or numbers used to track and identify criminal cases, including information such as law enforcement arrest tracking numbers, fatality indicators, commercial motor vehicle indicators, law enforcement incident tracking numbers, and traffic accident indicators.