"'Violation' of fiduciary duties" Language
type: Class
alternative label: 违反受托责任
subclass of: RB9kHJwRBkXjBRaeSNiyPWY
subclass of: RDxvjss5OK7lnAY9w2RaGeB
definition: The "Violation" of fiduciary duties refers to a breach of the legal obligation of loyalty and care that a fiduciary owes to their client or beneficiary, often resulting in harm or loss to the latter.