Modern Rape
type: Class
alternative label: 现代强奸
subclass of: R8fcGNgScyMlOAFxW5Omw5Y
definition: Non-consensual sexual intercourse that involves physical force, coercion, or the inability to give consent, and which is prosecuted under contemporary legal definitions and standards.