Anti-Virus Certificate
type: Class
alternative label: 防病毒证书
subclass of: R7wLLoc6H1zcuVpchb4e5lQ
definition: A certificate issued by an anti-virus software company verifying that a computer system is free of viruses or malware, typically used as evidence in legal proceedings.