Pennsylvania Magisterial District Court - Allegheny County
type: Class
subclass of: R70IGZ5XRTshj1E64tVcxJD
definition: A Pennsylvania Magisterial District Court located in Allegheny County, responsible for administering legal proceedings within its jurisdiction.