Municipal Corporation
type: Class
alternative label: 市政厅
subclass of: R7oBWHStfmqTLn2MypkW3Pj
hidden label: MUNI
definition: A municipal corporation is the legal term for a local governing body, including (but not necessarily limited to) cities, counties, towns, townships, charter townships, villages, and boroughs. The term can also be used to describe municipally owned corporations.