Nondispositive Stipulation
type: Class
alternative label: 非决定性协议
subclass of: R9dEPeCdgUgD0yqW0xOgLa5
definition: A Nondispositive Stipulation is an agreement between parties in a legal case that does not determine the outcome of the case, but rather sets forth certain facts or procedural matters that are not in dispute.