Copyright Infringement
type: Class
alternative label: 侵犯版权
subclass of: RJL4HDUmZp1VEEZ7lCwSSF
definition: The unauthorized use or reproduction of a copyrighted work, without the permission of the owner, which may include copying, distributing, displaying, or performing the work.