Swahili
type: Class
alternative label: 斯瓦希里语
subclass of: RDOvAHsvY8TKJ1O1orXPM9o
definition: Swahili is a structured system of communication consisting of grammar and vocabulary, used in legal matters, that is specifically identified as the language of Swahili.