Contact Name
type: Class
subclass of: R8QBuMoK1uPFeLW0sg40CdA
definition: Contact Name refers to the name of an individual, business, or organization. This name is used for communication and documentation purposes.