Dissolution for Deadlock
type: Class
alternative label: 僵局解散
subclass of: R9JkfZIjkVSa5ud1tJ14w3i
definition: The concept of "Dissolution for Deadlock" refers to a legal claim made by a corporation or partnership when the entity is unable to make decisions due to a deadlock among its members, resulting in the need for the entity to be dissolved.