Federal Highway Administration
type: Class
alternative label: 联邦公路管理局
subclass of: RC2Ddc09177c7B1338a16e36
hidden label: FHWA
definition: The Federal Highway Administration (FHWA) is a division of the United States Department of Transportation that specializes in highway transportation.