Contact Email
type: Class
alternative label: 联系电子邮件
subclass of: R8QBuMoK1uPFeLW0sg40CdA
definition: A contact email is a type of contact information used to communicate electronically, typically used for the purpose of exchanging messages or documents related to a legal matter.