Pennsylvania State Courts
type: Class
alternative label: PA
subclass of: R1F4dbe4CD17b3B2a7f15b97
hidden label: PA
definition: Pennsylvania State Courts are the judicial system responsible for interpreting and enforcing the laws of the state of Pennsylvania.