Probate Filing Type
type: Class
alternative label: 遗嘱认证申请类型
subclass of: RUKEFNs3cAPlchHsKzICjY
definition: A Probate Filing Type is a specific category of legal documents submitted to a court for the purpose of initiating or managing a probate case, such as Emergency or Successor Probate.