Rach'a-Lechkhumi-Kvemo Svaneti
type: Class
alternative label: GE+RL
subclass of: RB62c1302E565752670C3401
hidden label: GE+RL
definition: Rach'a-Lechkhumi-Kvemo Svaneti is a region in Georgia, located in the western part of the country.