Missouri State Courts
type: Class
alternative label: MO
subclass of: R1F4dbe4CD17b3B2a7f15b97
hidden label: MO
definition: Missouri State Courts are the judicial system of the state of Missouri, consisting of various courts such as the Missouri Court of Appeals, Missouri Circuit Court, and Missouri Supreme Court.