PBGC Office of the Inspector General
type: Class
alternative label: PBGC办公室的监察长
subclass of: R46A88e5E2f08A5B57519077
hidden label: PBGCOIG
definition: The mandate of the Office of the Inspector General (OIG) of the Pension Benefit Guaranty Corporation (PBGC) is to detect and prevent fraud, waste, abuse, and violations of law, and to promote economy, efficiency and effectiveness of the PBGC.