White Nile
type: Class
alternative label: SD+NW
subclass of: R7D2a4a5B3d44C416dfF6ba8
hidden label: SD+NW
definition: The White Nile is a river in Sudan that flows from Lake Victoria to Khartoum, where it meets the Blue Nile to form the Nile River.