Motion to Extend Automatic Stay
type: Class
alternative label: 延长自动停留动议
subclass of: R9Ii4OzSADsjS0VegX12oQJ
definition: A Motion to Extend Automatic Stay is a request made in a bankruptcy case to prolong the period during which creditors are prohibited from taking action against the debtor or the debtor's property without permission from the bankruptcy court.