Easement
type: Class
alternative label: 地役权
subclass of: R75Bx0QJin6XW4ki2c8pJGw
subclass of: RCkPc0XIMxDInzRipCUUZ1q
subclass of: RDSBerlLWg1ntpLqDQn1eVn
definition: An easement is a legal right to use someone else's property for a specific purpose, such as accessing a neighboring property or using a shared driveway.