Lac
type: Class
alternative label: TD+LC
subclass of: R6EDec6FF87ec502564FAddf
hidden label: TD+LC
definition: A "Lac" is a body of water that is surrounded by land and is smaller than a lake, typically found in the country of Chad.