Covenant Not to Sue Clause
type: Class
alternative label: 不起诉条款
subclass of: RDe0RKU39BlhcyACJW30ZLc
definition: A Covenant Not to Sue Clause is a contractual provision that prohibits one or both parties from pursuing legal action against each other in relation to a specific matter.