"Superior Offer" Thresholds
type: Class
alternative label: “优先报价”门槛
subclass of: RDxvjss5OK7lnAY9w2RaGeB
definition: A "Superior Offer" Threshold is a specific amount of assets or stock that must be offered in order to meet the requirements of a "Superior Offer" in a legal matter.