Contributory Copyright Infringement
type: Class
alternative label: 共同侵权
subclass of: R8xzICx2jmaNf0lhp5OGKx
definition: Contributory Copyright Infringement is a legal concept that holds a party liable for knowingly facilitating or encouraging another party's infringement of a copyright owner's exclusive rights.